{"text_format":"1","workbook":"xlsx","n_sheets":11,"sheets":["Dissemination Metrics","4.3.1","4.3.2","4.3.3","4.3.4","4.3.5","4.3.6","4.3.7","Milestones","EVAL","Sheet1"],"not_rendered":{"charts":0,"images":0,"macros":1,"external_links":0,"defined_names":6,"comments":0,"pivot_tables":0},"unopened":[],"bounds":{"document_bytes":16777216,"sheet_cells":100000,"rows_first":2000,"rows_last":500,"rows_between":2000,"halvings":0,"cell_chars":16384,"cell_head_chars":4096},"cells_cut":0,"cells_raw":0,"read":"whole","date_system":"1900"}

{"sheet":"Dissemination Metrics","index":0,"n_rows":46,"n_cols":2,"rows_kept":46,"cut":false,"hidden":false,"merged":[]}
[4.3,"Outreach & Engagement Metrics"]
[]
["Number","Title"]
["4.3.1","Number of events GridPP attends with stand/posters/talks"]
["Metric","Four per year"]
["Source","Dissemination officer"]
[]
["4.3.2","Number of GridPP publications"]
["Metric","10 per year"]
["Source","Dissemination officer"]
[]
["4.3.3","Number of articles on GridPP web site"]
["Metric","One every 2 weeks"]
["Source","Dissemination officer"]
[]
["4.3.4","Number of GridPP press releases"]
["Metric","1 per year"]
["Source","Dissemination officer"]
[]
["4.3.5","Number of press articles about GridPP"]
["Metric","5 per year"]
["Source","Dissemination officer"]
[]
["4.3.6","Number of KE exploration meetings held"]
["Metric","1 per year"]
["Source","Dissemination officer"]
[]
["4.3.7","Number of non-GridPP funded Groups who use GridPP hardware"]
["Metric",10]
["Source","Dissemination officer"]
[]
["4.3.8","KE sections of GridPP website updated"]
["Milestone","31st Dec 2016"]
["Source","Dissemination officer"]
[]
["4.3.9","KE sections of GridPP website updated"]
["Milestone","31st Dec 2017"]
["Source","Dissemination officer"]
[]
["4.3.10","KE sections of GridPP website updated"]
["Milestone","31st Dec 2018"]
["Source","Dissemination officer"]
[]
["4.3.11","KE sections of GridPP website updated"]
["Milestone","31st Dec 2019"]
["Source","Dissemination officer"]

{"sheet":"4.3.1","index":1,"n_rows":36,"n_cols":4,"rows_kept":36,"cut":false,"hidden":false,"merged":[[35,0,35,1],[25,0,25,2],[27,0,27,1],[32,0,32,1],[29,0,29,2],[33,0,33,2]]}
[{"$f":"'Dissemination Metrics'!A4","v":"4.3.1"},{"$f":"'Dissemination Metrics'!B4","v":"Number of events GridPP attends with stand/posters/talks"}]
["Target",{"$f":"'Dissemination Metrics'!B5","v":"Four per year"}]
["Target Per Quarter",1,"Passed"]
["Q1 2016",{"$f":"C28","v":1},{"$f":"IF(B4>=$B$3,\"Yes\",\"No\")","v":"Yes"}]
["Q2 2016",{"$f":"C33","v":1},{"$f":"IF(B5>=$B$3,\"Yes\",\"No\")","v":"Yes"}]
["Q3 2016"]
["Q4 2016"]
["Q1 2017"]
["Q2 2017"]
["Q3 2017"]
["Q4 2017"]
["Q1 2018"]
["Q2 2018"]
["Q3 2018"]
["Q4 2018"]
["Q1 2019"]
["Q2 2019"]
["Q3 2019"]
["Q4 2019"]
["Q1 2020"]
[]
["Final Total",{"$f":"SUM(B4:B20)","v":2},{"$f":"IF(B22>=$B$3*4,\"Yes\",\"No\")","v":"No"}]
[]
[]
["Count","Event","Date"]
["Q1 - January 2016 to March 2016"]
[1,"Ganga workshop - HEP SYSMAN January 2016",null,"http://indico.cern.ch/event/465558/"]
["Total for this quarter",null,{"$f":"SUM(A27:A27)","v":1}]
[]
["Q2 - April 2016 to June 2016"]
[1,"CernVM Users Workshop, RAL, June 2016",null,"https://indico.cern.ch/event/469775/"]
[]
["Total for this quarter",null,{"$f":"SUM(A31:A32)","v":1}]
["Q3 - July 2016 to September 2016"]
[0]
["Total for this quarter",null,{"$f":"SUM(A34:A35)","v":0}]

{"sheet":"4.3.2","index":2,"n_rows":35,"n_cols":4,"rows_kept":35,"cut":false,"hidden":false,"merged":[[32,0,32,1],[33,0,33,2],[24,0,24,16383],[26,0,26,1],[27,0,27,2],[29,0,29,1],[30,0,30,2]]}
[{"$f":"'Dissemination Metrics'!A8","v":"4.3.2"},{"$f":"'Dissemination Metrics'!B8","v":"Number of GridPP publications"},"http://www.gridpp.ac.uk/papers/"]
["Target",{"$f":"'Dissemination Metrics'!B9","v":"10 per year"}]
["Target Per Quarter",2.5,"Passed"]
[{"$f":"'4.3.1'!A4","v":"Q1 2016"},{"$f":"C27","v":1},{"$f":"IF(B4>=$B$3,\"Yes\",\"No\")","v":"No"}]
[{"$f":"'4.3.1'!A5","v":"Q2 2016"},{"$f":"C30","v":1},{"$f":"IF(B5>=$B$3,\"Yes\",\"No\")","v":"No"}]
[{"$f":"'4.3.1'!A6","v":"Q3 2016"},{"$f":"C33","v":1},"No"]
[{"$f":"'4.3.1'!A7","v":"Q4 2016"},null,"No"]
[{"$f":"'4.3.1'!A8","v":"Q1 2017"},null,"No"]
[{"$f":"'4.3.1'!A9","v":"Q2 2017"},null,"No"]
[{"$f":"'4.3.1'!A10","v":"Q3 2017"},null,"No"]
[{"$f":"'4.3.1'!A11","v":"Q4 2017"},null,"No"]
[{"$f":"'4.3.1'!A12","v":"Q1 2018"},null,"No"]
[{"$f":"'4.3.1'!A13","v":"Q2 2018"},null,"No"]
[{"$f":"'4.3.1'!A14","v":"Q3 2018"},null,"No"]
[{"$f":"'4.3.1'!A15","v":"Q4 2018"},null,"No"]
[{"$f":"'4.3.1'!A16","v":"Q1 2019"},null,"No"]
[{"$f":"'4.3.1'!A17","v":"Q2 2019"},null,"No"]
[{"$f":"'4.3.1'!A18","v":"Q3 2019"},null,"No"]
[{"$f":"'4.3.1'!A19","v":"Q4 2019"},null,"No"]
[{"$f":"'4.3.1'!A20","v":"Q1 2020"}]
["Final Total",{"$f":"SUM(B4:B19)","v":3},{"$f":"IF(B21>=$B$3*16,\"Yes\",\"No\")","v":"No"}]
[]
[]
["Count","Event","Date"]
["Q1 - January 2016 to March 2016"]
[1,"Applications",null,"http://dx.doi.org/10.1080/10619127.2015.1104132"]
["Total for this quarter",null,{"$f":"SUM(A26)","v":1}]
["Q2 - April 2016 to June 2016"]
[1,"Applications",null,"http://dx.doi.org/10.1016/j.nuclphysbps.2015.09.202"]
["Total for this quarter",null,{"$f":"SUM(A29)","v":1}]
["Q3 - July 2016 to September 2016"]
[1,"Applications",null,"https://arxiv.org/abs/1607.01749"]
["Total for this quarter",null,{"$f":"SUM(A32)","v":1}]
["Q4 - October 2016 to December 2016"]
[null,null,null,"CHEP 2016?"]

{"sheet":"4.3.3","index":3,"n_rows":44,"n_cols":4,"rows_kept":44,"cut":false,"hidden":false,"merged":[[43,0,43,1],[24,0,24,16383],[27,0,27,1],[28,0,28,2],[37,0,37,1],[38,0,38,2]]}
[{"$f":"'Dissemination Metrics'!A12","v":"4.3.3"},{"$f":"'Dissemination Metrics'!B12","v":"Number of articles on GridPP web site"},"http://www.gridpp.ac.uk/news/?page_id=504 (News Items)"]
["Target",{"$f":"'Dissemination Metrics'!B13","v":"One every 2 weeks"}]
["Target Per Quarter",6,"Passed"]
[{"$f":"'4.3.1'!A4","v":"Q1 2016"},{"$f":"$C$28","v":2},{"$f":"IF(B4>=$B$3,\"Yes\",\"No\")","v":"No"}]
[{"$f":"'4.3.1'!A5","v":"Q2 2016"},{"$f":"$C$38","v":8},{"$f":"IF(B5>=$B$3,\"Yes\",\"No\")","v":"Yes"}]
[{"$f":"'4.3.1'!A6","v":"Q3 2016"},null,"No"]
[{"$f":"'4.3.1'!A7","v":"Q4 2016"},null,"No"]
[{"$f":"'4.3.1'!A8","v":"Q1 2017"},null,"No"]
[{"$f":"'4.3.1'!A9","v":"Q2 2017"},null,"No"]
[{"$f":"'4.3.1'!A10","v":"Q3 2017"},null,"No"]
[{"$f":"'4.3.1'!A11","v":"Q4 2017"},null,"No"]
[{"$f":"'4.3.1'!A12","v":"Q1 2018"},null,"No"]
[{"$f":"'4.3.1'!A13","v":"Q2 2018"},null,"No"]
[{"$f":"'4.3.1'!A14","v":"Q3 2018"},null,"No"]
[{"$f":"'4.3.1'!A15","v":"Q4 2018"},null,"No"]
[{"$f":"'4.3.1'!A16","v":"Q1 2019"},null,"No"]
[{"$f":"'4.3.1'!A17","v":"Q2 2019"},null,"No"]
[{"$f":"'4.3.1'!A18","v":"Q3 2019"},null,"No"]
[{"$f":"'4.3.1'!A19","v":"Q4 2019"},null,"No"]
[{"$f":"'4.3.1'!A20","v":"Q1 2020"}]
["Final Total",{"$f":"SUM(B4:B19)","v":10},{"$f":"IF(B21>=$B$3*4*4,\"Yes\",\"No\")","v":"No"}]
[]
[]
["Count","Title","Date"]
["Q1 - January 2016 to March 2016"]
[1,"GridPP at HEP SYSMAN January 2016",null,"https://www.gridpp.ac.uk/news-2016-01-18-hepsysman/"]
[1,"GridPP36 Preview: New directions in GridPP5",null,"https://www.gridpp.ac.uk/news-2016-04-15-gridpp36/"]
["Total for this quarter",null,{"$f":"SUM(A26:A27)","v":2}]
["Q2 - April 2016 to June 2016"]
[1,"GridPP36: New directions in GridPP5",null,"https://www.gridpp.ac.uk/news-2016-04-15-gridpp36/"]
[1,"CernVM Users Workshop - News Item",null,"https://www.gridpp.ac.uk/news-2016-06-16-cernvm-workshop/"]
[1,"Case study - LSST",null,"https://www.gridpp.ac.uk/users/case-studies/lsst/"]
[1,"Case study - PRaVDA",null,"https://www.gridpp.ac.uk/users/case-studies/pravda/"]
[1,"Services - Ganga",null,"https://www.gridpp.ac.uk/services/ganga/"]
[1,"Services - GridPP DIRAC",null,"https://www.gridpp.ac.uk/services/gridppdirac/"]
[1,"Services - CernVM",null,"https://www.gridpp.ac.uk/services/cernvm/"]
[1,"Services - CVMFS",null,"https://www.gridpp.ac.uk/services/cvmfs/"]
["Total for this quarter",null,{"$f":"SUM(A30:A37)","v":8}]
["Q3 - July 2016 to September 2016"]
[1,"GridPP37: (R)evolution",null,"https://www.gridpp.ac.uk/news-2016-09-05-gridpp37-revolution/"]
[1,"GridPP support for the MoEDAL experiment",null,"https://www.gridpp.ac.uk/news-2016-09-12-gridpp-support-for-moedal/"]
[1,"Deploying software the easy way with CVMFS",null,"https://www.gridpp.ac.uk/news-2016-09-22-software-deployment-cvmfs/"]
[1,"Queen Mary University of London - site details",null,"https://www.gridpp.ac.uk/infrastructure/the-uk-tier-2-sites/qmul/"]
["Total for this quarter",null,{"$f":"SUM(A40:A43)","v":4}]

{"sheet":"4.3.4","index":4,"n_rows":33,"n_cols":3,"rows_kept":33,"cut":false,"hidden":false,"merged":[[32,0,32,1],[24,0,24,16383],[26,0,26,1],[27,0,27,2],[29,0,29,1],[30,0,30,2]]}
[{"$f":"'Dissemination Metrics'!A16","v":"4.3.4"},{"$f":"'Dissemination Metrics'!B16","v":"Number of GridPP press releases"}]
["Target",{"$f":"'Dissemination Metrics'!B17","v":"1 per year"}]
["Target Per Quarter",0.25,"Passed"]
[{"$f":"'4.3.1'!A4","v":"Q1 2016"},{"$f":"C27","v":0},{"$f":"IF(B4>=$B$3,\"Yes\",\"No\")","v":"No"}]
[{"$f":"'4.3.1'!A5","v":"Q2 2016"},{"$f":"$C$30","v":1},{"$f":"IF(B5>=$B$3,\"Yes\",\"No\")","v":"Yes"}]
[{"$f":"'4.3.1'!A6","v":"Q3 2016"},null,"No"]
[{"$f":"'4.3.1'!A7","v":"Q4 2016"},null,"No"]
[{"$f":"'4.3.1'!A8","v":"Q1 2017"},null,"No"]
[{"$f":"'4.3.1'!A9","v":"Q2 2017"},null,"No"]
[{"$f":"'4.3.1'!A10","v":"Q3 2017"},null,"No"]
[{"$f":"'4.3.1'!A11","v":"Q4 2017"},null,"No"]
[{"$f":"'4.3.1'!A12","v":"Q1 2018"},null,"No"]
[{"$f":"'4.3.1'!A13","v":"Q2 2018"},null,"No"]
[{"$f":"'4.3.1'!A14","v":"Q3 2018"},null,"No"]
[{"$f":"'4.3.1'!A15","v":"Q4 2018"},null,"No"]
[{"$f":"'4.3.1'!A16","v":"Q1 2019"},null,"No"]
[{"$f":"'4.3.1'!A17","v":"Q2 2019"},null,"No"]
[{"$f":"'4.3.1'!A18","v":"Q3 2019"},null,"No"]
[{"$f":"'4.3.1'!A19","v":"Q4 2019"},null,"No"]
[{"$f":"'4.3.1'!A20","v":"Q1 2020"}]
["Final Total",{"$f":"SUM(B4:B19)","v":1},{"$f":"IF(B21>=$B$3*4,\"Yes\",\"No\")","v":"Yes"}]
[]
[]
["Count","Title","Date"]
["Q1 - January 2016 to March 2016"]
[0,"None"]
["Total for this quarter",null,0]
["Q2 - April 2016 to June 2016"]
[1,"LSST - \"Sheer Brilliance\""]
["Total for this quarter",null,{"$f":"SUM(A29:A29)","v":1}]
["Q3 - July 2016 to September 2016"]
[0]
["Total for this quarter",null,{"$f":"SUM(A32:A32)","v":0}]

{"sheet":"4.3.5","index":5,"n_rows":33,"n_cols":5,"rows_kept":33,"cut":false,"hidden":false,"merged":[[32,0,32,1],[24,0,24,16383],[26,0,26,1],[27,0,27,16383],[29,0,29,1],[30,0,30,2]]}
[{"$f":"'Dissemination Metrics'!A20","v":"4.3.5"},{"$f":"'Dissemination Metrics'!B20","v":"Number of press articles about GridPP"}]
["Target",{"$f":"'Dissemination Metrics'!B21","v":"5 per year"}]
["Target Per Quarter",1.25,"Passed"]
[{"$f":"'4.3.1'!A4","v":"Q1 2016"},{"$f":"C27","v":0},{"$f":"IF(B4>=$B$3,\"Yes\",\"No\")","v":"No"}]
[{"$f":"'4.3.1'!A5","v":"Q2 2016"},{"$f":"$C$30","v":1},{"$f":"IF(B5>=$B$3,\"Yes\",\"No\")","v":"No"}]
[{"$f":"'4.3.1'!A6","v":"Q3 2016"},null,"No"]
[{"$f":"'4.3.1'!A7","v":"Q4 2016"},null,"No"]
[{"$f":"'4.3.1'!A8","v":"Q1 2017"},null,"No"]
[{"$f":"'4.3.1'!A9","v":"Q2 2017"},null,"No"]
[{"$f":"'4.3.1'!A10","v":"Q3 2017"},null,"No"]
[{"$f":"'4.3.1'!A11","v":"Q4 2017"},null,"No"]
[{"$f":"'4.3.1'!A12","v":"Q1 2018"},null,"No"]
[{"$f":"'4.3.1'!A13","v":"Q2 2018"},null,"No"]
[{"$f":"'4.3.1'!A14","v":"Q3 2018"},null,"No"]
[{"$f":"'4.3.1'!A15","v":"Q4 2018"},null,"No"]
[{"$f":"'4.3.1'!A16","v":"Q1 2019"},null,"No"]
[{"$f":"'4.3.1'!A17","v":"Q2 2019"},null,"No"]
[{"$f":"'4.3.1'!A18","v":"Q3 2019"},null,"No"]
[{"$f":"'4.3.1'!A19","v":"Q4 2019"},null,"No"]
[{"$f":"'4.3.1'!A20","v":"Q1 2020"}]
["Final Total",{"$f":"SUM(B4:B19)","v":1},{"$f":"IF(B21>=$B$3*5*4,\"Yes\",\"No\")","v":"No"}]
[]
[]
["Count","Title","Publication","Date","URL (if applicable)"]
["Q1 - January 2016 to March 2016"]
[0,"None"]
["Total for this quarter",null,{"$f":"SUM(A26:A26)","v":0}]
["Q2 - April 2016 to June 2016"]
[1,"Business Insider feature on the LHC",null,"2016-04-03","http://uk.businessinsider.com/inside-the-lhc-cern-2016-4"]
["Total for this quarter",null,{"$f":"SUM(A29:A29)","v":1}]
["Q3 - July 2016 to September 2016"]
[0]
["Total for this quarter",null,{"$f":"SUM(A32:A32)","v":0}]

{"sheet":"4.3.6","index":6,"n_rows":34,"n_cols":4,"rows_kept":34,"cut":false,"hidden":false,"merged":[[33,0,33,1],[24,0,24,16383],[26,0,26,1],[27,0,27,16383],[29,0,29,1],[30,0,30,2]]}
[{"$f":"'Dissemination Metrics'!A24","v":"4.3.6"},{"$f":"'Dissemination Metrics'!B24","v":"Number of KE exploration meetings held"}]
["Target",{"$f":"'Dissemination Metrics'!B25","v":"1 per year"}]
["Target Per Quarter",0.25,"Passed"]
[{"$f":"'4.3.1'!A4","v":"Q1 2016"},{"$f":"C27","v":1},{"$f":"IF(B4>=$B$3,\"Yes\",\"No\")","v":"Yes"}]
[{"$f":"'4.3.1'!A5","v":"Q2 2016"},{"$f":"$C$30","v":0},{"$f":"IF(B5>=$B$3,\"Yes\",\"No\")","v":"No"}]
[{"$f":"'4.3.1'!A6","v":"Q3 2016"},null,"No"]
[{"$f":"'4.3.1'!A7","v":"Q4 2016"},null,"No"]
[{"$f":"'4.3.1'!A8","v":"Q1 2017"},null,"No"]
[{"$f":"'4.3.1'!A9","v":"Q2 2017"},null,"No"]
[{"$f":"'4.3.1'!A10","v":"Q3 2017"},null,"No"]
[{"$f":"'4.3.1'!A11","v":"Q4 2017"},null,"No"]
[{"$f":"'4.3.1'!A12","v":"Q1 2018"},null,"No"]
[{"$f":"'4.3.1'!A13","v":"Q2 2018"},null,"No"]
[{"$f":"'4.3.1'!A14","v":"Q3 2018"},null,"No"]
[{"$f":"'4.3.1'!A15","v":"Q4 2018"},null,"No"]
[{"$f":"'4.3.1'!A16","v":"Q1 2019"},null,"No"]
[{"$f":"'4.3.1'!A17","v":"Q2 2019"},null,"No"]
[{"$f":"'4.3.1'!A18","v":"Q3 2019"},null,"No"]
[{"$f":"'4.3.1'!A19","v":"Q4 2019"},null,"No"]
[{"$f":"'4.3.1'!A20","v":"Q1 2020"}]
["Final Total",{"$f":"SUM(B4:B19)","v":1},{"$f":"IF(B21>=$B$3*4*4,\"Yes\",\"No\")","v":"No"}]
[]
[]
["Count","Description of Meeting","Date"]
["Q1 - January 2016 to March 2016"]
[1,"SeeCycle.cc (at RAL)","2016-02-22"]
["Total for this quarter",null,{"$f":"SUM(A26)","v":1}]
["Q2 - April 2016 to June 2016"]
[0]
["Total for this quarter",null,{"$f":"SUM(A29)","v":0}]
["Q3 - July 2016 to September 2016"]
[1,"Satellite Applications Catapult Sataccino Summer BBQ, 6th July 2016",null,"Networking event"]
[1,"Meeting with Stephen Ringler - RAL Space Oxford, 19th July 2016"]
["Total for this quarter",null,{"$f":"SUM(A32:A33)","v":2}]

{"sheet":"4.3.7","index":7,"n_rows":79,"n_cols":4,"rows_kept":79,"cut":false,"hidden":false,"merged":[[5,0,5,16383],[30,0,30,16383],[55,0,55,2]]}
[{"$f":"'Dissemination Metrics'!A28","v":"4.3.7"},{"$f":"'Dissemination Metrics'!B28","v":"Number of non-GridPP funded Groups who use GridPP hardware"},{"$f":"'Dissemination Metrics'!C28","v":0}]
["Target",{"$f":"'Dissemination Metrics'!B29","v":10},"https://accounting-next.egi.eu","(UK NGI, all VOs) (Non-GridPP"]
["Current Number",{"$f":"B30","v":23},null,"funded groups using GridPP hardware)"]
[]
["Count","Group"]
["Q1 - January 2016 to March 2016"]
[1,"biomed"]
[1,"calice"]
[1,"cernatschool.org"]
[1,"comet.j-parc.jp"]
[1,"enmr.eu"]
[1,"fermilab"]
[1,"geant4"]
[1,"gridpp"]
[1,"ilc"]
[1,"lsst"]
[1,"lz"]
[1,"mice"]
[1,"na62"]
[1,"nordugrid"]
[1,"pheno"]
[1,"snoplus.snolab.ca"]
[1,"t2k.org"]
[1,"vo.landslides.mossaic.org"]
[1,"vo.londongrid.ac.uk"]
[1,"vo.northgrid.ac.uk"]
[1,"vo.scotgrid.ac.uk"]
[1,"vo.southgrid.ac.uk"]
[1,"zeus"]
["Totals for this quarter",{"$f":"SUM(A7:A29)","v":23}]
["Q2 - April 2016 to June 2016"]
[1,"biomed"]
[1,"calice"]
[1,"cernatschool.org"]
[1,"comet.j-parc.jp"]
[1,"dune"]
[1,"enmr.eu"]
[1,"esr"]
[1,"geant4"]
[1,"icecube"]
[1,"ilc"]
[1,"lsst"]
[1,"lz"]
[1,"mice"]
[1,"na62.vo.gridpp.ac.uk"]
[1,"pheno"]
[1,"skatelescope.eu"]
[1,"snoplus.snolab.ca"]
[1,"solidexperiment.org"]
[1,"t2k.org"]
[1,"vo.londongrid.ac.uk"]
[1,"vo.northgrid.ac.uk"]
[1,"vo.scotgrid.ac.uk"]
[1,"vo.southgrid.ac.uk"]
["Totals for this quarter",{"$f":"SUM(A32:A54)","v":23}]
["Q3 - July 2016 to September 2016"]
[1,"biomed"]
[1,"cernatschool.org"]
[1,"comet.j-parc.jp"]
[1,"dune"]
[1,"enmr.eu"]
[1,"esr"]
[1,"gridpp"]
[1,"icecube"]
[1,"ilc"]
[1,"lsst"]
[1,"lz"]
[1,"mice"]
[1,"na62.vo.gridpp.ac.uk"]
[1,"pheno"]
[1,"skatelescope.eu"]
[1,"snoplus.snolab.ca"]
[1,"t2k.org"]
[1,"vo.londongrid.ac.uk"]
[1,"vo.moedal.org"]
[1,"vo.northgrid.ac.uk"]
[1,"vo.scotgrid.ac.uk"]
[1,"vo.southgrid.ac.uk"]
["Totals for this quarter",{"$f":"SUM(A57:A78)","v":22}]

{"sheet":"Milestones","index":8,"n_rows":5,"n_cols":5,"rows_kept":5,"cut":false,"hidden":false,"merged":[]}
["Milestone","Description","Target Completion Date","Date Completed","Comments"]
[{"$f":"'Dissemination Metrics'!A32","v":"4.3.8"},{"$f":"'Dissemination Metrics'!B32","v":"KE sections of GridPP website updated"},{"$f":"'Dissemination Metrics'!B33","v":"31st Dec 2016"}]
[{"$f":"'Dissemination Metrics'!A36","v":"4.3.9"},{"$f":"'Dissemination Metrics'!B36","v":"KE sections of GridPP website updated"},{"$f":"'Dissemination Metrics'!B37","v":"31st Dec 2017"}]
[{"$f":"'Dissemination Metrics'!A40","v":"4.3.10"},{"$f":"'Dissemination Metrics'!B40","v":"KE sections of GridPP website updated"},{"$f":"'Dissemination Metrics'!B41","v":"31st Dec 2018"}]
[{"$f":"'Dissemination Metrics'!A44","v":"4.3.11"},{"$f":"'Dissemination Metrics'!B44","v":"KE sections of GridPP website updated"},{"$f":"'Dissemination Metrics'!B45","v":"31st Dec 2019"}]

{"sheet":"EVAL","index":9,"n_rows":29,"n_cols":9,"rows_kept":29,"cut":false,"hidden":false,"merged":[[2,1,2,5],[2,6,2,7],[2,8,2,12],[3,1,3,5],[3,6,3,7],[3,8,3,12],[4,1,4,5],[4,6,4,7],[4,8,4,12],[5,1,5,5],[5,6,5,7],[5,8,5,12],[6,1,6,5],[6,6,6,7],[6,8,6,12],[7,1,7,5],[7,6,7,7],[7,8,7,12],[8,1,8,5],[8,6,8,7],[8,8,8,12],[9,1,9,5],[9,6,9,7],[9,8,9,12],[10,1,10,5],[10,6,10,7],[10,8,10,12],[11,1,11,5],[11,6,11,7],[11,8,11,12],[12,1,12,5],[12,6,12,7],[12,8,12,12],[13,1,13,5],[13,6,13,7],[13,8,13,12],[14,1,14,5],[14,6,14,7],[14,8,14,12],[15,1,15,5],[15,6,15,7],[15,8,15,12],[18,1,18,5],[18,6,18,7],[18,8,18,12],[19,1,19,5],[19,6,19,7],[19,8,19,12],[20,1,20,5],[20,6,20,7],[20,8,20,12],[21,1,21,5],[21,6,21,7],[21,8,21,12],[22,1,22,5],[22,6,22,7],[22,8,22,12],[23,1,23,5],[23,6,23,7],[23,8,23,12],[24,1,24,5],[24,6,24,7],[24,8,24,12],[25,1,25,5],[25,6,25,7],[25,8,25,12],[26,1,26,5],[26,6,26,7],[26,8,26,12],[27,1,27,5],[27,6,27,7],[27,8,27,12],[30,1,30,5],[30,6,30,7],[30,8,30,12],[28,1,28,5],[28,6,28,7],[28,8,28,12],[29,1,29,5],[29,6,29,7],[29,8,29,12],[16,1,16,5],[16,6,16,7],[16,8,16,12],[17,1,17,5],[17,6,17,7],[17,8,17,12]]}
[]
[null,"EVAL Notes"]
[null,"Publications",null,null,null,null," Date",null,"Notes"]
[]
[]
[null,"Collaborations",null,null,null,null," Date",null,"Notes"]
[]
[]
[null,"Further Funding (eg external grants)",null,null,null,null," Date",null,"Notes"]
[]
[]
[null,"Destination of ex staff and recruitment issues",null,null,null,null," Date",null,"Notes"]
[]
[]
[null,"Dissemmination events",null,null,null,null," Date",null,"Notes"]
[]
[]
[]
[]
[null,"Intellectual Property",null,null,null,null," Date",null,"Notes"]
[]
[]
[null,"Spin out companies",null,null,null,null," Date",null,"Notes"]
[]
[]
[null,"Roles held on committees and boards",null,null,null,null," Date",null,"Notes"]
[]
[]
[null,"Other outputs and Knowledge",null,null,null,null," Date",null,"Notes"]

{"sheet":"Sheet1","index":10,"n_rows":0,"n_cols":0,"rows_kept":0,"cut":false,"hidden":false,"merged":[]}